Target
D(1A) dopamine receptor
Ligand
BDBM78433
Substrate
Ki
242±n/a nM
Comments
PDSP_837
Citation
 Burt, DRCreese, ISnyder, SH Properties of [3H]haloperidol and [3H]dopamine binding associated with dopamine receptors in calf brain membranes. Mol Pharmacol 12:800-12 (1976) Target
Name:
D(1A) dopamine receptor
Synonyms:
D(1A) dopamine receptor DOPAMINE D1 DRD1_BOVIN | Dopamine receptor
Type:
Enzyme Catalytic Domain
Mol. Mass.:
49330.65
Organism:
BOVINE
Description:
DOPAMINE D1 DRD1 BOVINE::Q95136
Residue:
446
  
Inhibitor
Name:
BDBM78433
Synonyms:
2-[4-[3-[2-(trifluoromethyl)-10-phenothiazinyl]propyl]-1-piperazinyl]ethanol;hydrochloride 2-[4-[3-[2-(trifluoromethyl)phenothiazin-10-yl]propyl]piperazino]ethanol;hydrochloride FLUPHENAZINE HYDROCHLORIDE SMR000058411 cid_6602611 | med.21724, Compound 17
Type:
Small organic molecule
Emp. Form.:
C22H26F3N3OS
Mol. Mass.:
437.522
SMILES:
OCCN1CCN(CCCN2c3ccccc3Sc3ccc(cc23)C(F)(F)F)CC1
: