Target
D(2) dopamine receptor
Ligand
BDBM78576
Substrate
Ki
1.5±n/a nM
Comments
PDSP_531
Citation
 Burt, DRCreese, ISnyder, SH Properties of [3H]haloperidol and [3H]dopamine binding associated with dopamine receptors in calf brain membranes. Mol Pharmacol 12:800-12 (1976) Target
Name:
D(2) dopamine receptor
Synonyms:
DOPAMINE D2 DRD2_BOVIN | Dopamine D2 receptor
Type:
Enzyme Catalytic Domain
Mol. Mass.:
50698.79
Organism:
BOVINE
Description:
P20288
Residue:
444
  
Inhibitor
Name:
BDBM78576
Synonyms:
CIS-THIOTHIXENE SMR000058396 cid_941651 | med.21724, Compound Thiothixene
Type:
Small organic molecule
Emp. Form.:
C23H29N3O2S2
Mol. Mass.:
443.625
SMILES:
CN(C)S(=O)(=O)c1ccc2Sc3ccccc3\C(=C\CCN3CCN(C)CC3)c2c1
: