Target
Efflux pump membrane transporter
Ligand
BDBM81507
Substrate
Meas. Tech.
Binding Assay
pH
7.5±0
Kd
590000±0.0 nM
Citation
 Tikhonova, EBYamada, YZgurskaya, HI Sequential mechanism of assembly of multidrug efflux pump AcrAB-TolC. Chem Biol 18:454-63 (2011)  
Target
Name:
Efflux pump membrane transporter
Synonyms:
AcrAB-TolC Acriflavine resistance protein B Transporter, hydrophobe/amphiphile efflux-1 (HAE1) family
Type:
Protein
Mol. Mass.:
113561.74
Organism:
Escherichia coli
Description:
C6EL02
Residue:
1049
  
Inhibitor
Name:
BDBM81507
Synonyms:
MC-207,110
Type:
Small organic molecule
Emp. Form.:
C25H30N6O2
Mol. Mass.:
446.5447
SMILES:
[#7]-[#6@@H](-[#6]-c1ccccc1)-[#6](=O)-[#7]-[#6](-[#6]-[#6]-[#6]\[#7]=[#6](\[#7])-[#7])-[#6](=O)-[#7]-c1ccc2ccccc2c1
: