Target
Acidic mammalian chitinase
Ligand
BDBM81508
Substrate
Meas. Tech.
Enzymatic Assay
pH
5.2±0
Temperature
310.15±0 K
IC50
2.0e+4± 1e+3 nM
Citation
 Sutherland, TEAndersen, OABetou, MEggleston, IMMaizels, RMvan Aalten, DAllen, JE Analyzing airway inflammation with chemical biology: dissection of acidic mammalian chitinase function with a selective drug-like inhibitor. Chem Biol 18:569-79 (2011)  
Target
Name:
Acidic mammalian chitinase
Synonyms:
AMCase CHIA Lung-specific protein TSA1902
Type:
Protein
Mol. Mass.:
52266.66
Organism:
Homo sapiens (Human)
Description:
Q9BZP6
Residue:
476
  
Inhibitor
Name:
BDBM81508
Synonyms:
Bisdionin C
Type:
Small organic molecule
Emp. Form.:
C17H20N8O4
Mol. Mass.:
400.3919
SMILES:
Cn1cnc2n(C)c(=O)n(CCCn3c(=O)n(C)c4ncn(C)c4c3=O)c(=O)c12
: