Target
Chitotriosidase-1
Ligand
BDBM81509
Substrate
Meas. Tech.
Enzymatic Assay
pH
5.2±0
Temperature
310.15±0 K
IC50
1.7e+4± 1e+3 nM
Citation
 Sutherland, TEAndersen, OABetou, MEggleston, IMMaizels, RMvan Aalten, DAllen, JE Analyzing airway inflammation with chemical biology: dissection of acidic mammalian chitinase function with a selective drug-like inhibitor. Chem Biol 18:569-79 (2011)  
Target
Name:
Chitotriosidase-1
Synonyms:
CHIT1 Chitinase 1 Chitotriosidase Chitotriosidase-1 (CHIT1)
Type:
Enzyme
Mol. Mass.:
51682.25
Organism:
Homo sapiens (Human)
Description:
Q13231
Residue:
466
  
Inhibitor
Name:
BDBM81509
Synonyms:
Bisdionin F
Type:
Small organic molecule
Emp. Form.:
C16H18N8O4
Mol. Mass.:
386.3653
SMILES:
Cn1cnc2n(C)c(=O)n(CCCn3c(=O)n(C)c4nc[nH]c4c3=O)c(=O)c12
: