Target
Leukotriene B4 receptor 2
Ligand
BDBM81520
Substrate
Ki
1840±n/a nM
Comments
PDSP_494
Citation
 Jackson, RHMorrissey, MMSills, MAJarvis, MF Comparison of antagonist and agonist binding to the leukotriene B4 receptor intact human polymorphonuclear neutrophils (PMN). J Pharmacol Exp Ther 262:80-9 (1992) Target
Name:
Leukotriene B4 receptor 2
Synonyms:
BLT2R LT4R2_HUMAN LTB4-R 2 LTB4R2 Leukotriene B4 Leukotriene B4 receptor Leukotriene B4 receptor BLT2 Seven transmembrane receptor BLTR2
Type:
Enzyme Catalytic Domain
Mol. Mass.:
37964.86
Organism:
Homo sapiens (Human)
Description:
Leukotriene 2 0 HUMAN::Q9NPC1
Residue:
358
  
Inhibitor
Name:
BDBM81520
Synonyms:
CGS 23113
Type:
Small organic molecule
Emp. Form.:
C22H35NO3
Mol. Mass.:
361.5182
SMILES:
CCCCCCCCC(O)\C=C\c1cccc(n1)C1OC1CCCCO
: