Target
Histamine H1 receptor
Ligand
BDBM7966
Substrate
Ki
100±n/a nM
Comments
PDSP_934
Citation
 Hill, SJ Multiple histamine receptors: properties and functional characteristics. Biochem Soc Trans 20:122-5 (1992)  
Target
Name:
Histamine H1 receptor
Synonyms:
HISTAMINE H1 HRH1_CAVPO
Type:
G Protein-Coupled Receptor (GPCR)
Mol. Mass.:
55641.53
Organism:
Cavia porcellus (domestic guinea pig)
Description:
Guinea pig cerebellum was used in binding assay.
Residue:
488
  
Inhibitor
Name:
BDBM7966
Synonyms:
2-(1H-imidazol-4-yl)ethan-1-amine CHEMBL90 Ergotidine Histamine Peremin | [3H]histamine
Type:
Small organic molecule
Emp. Form.:
C5H9N3
Mol. Mass.:
111.1451
SMILES:
NCCc1cnc[nH]1
: