Target
Histamine H2 receptor
Ligand
BDBM81542
Substrate
Ki
0.9±n/a nM
Comments
PDSP_359
Citation
 Hill, SJ Multiple histamine receptors: properties and functional characteristics. Biochem Soc Trans 20:122-5 (1992)  
Target
Name:
Histamine H2 receptor
Synonyms:
Gastric receptor I HISTAMINE H2 HRH2_CAVPO | Histamine H2-Gs alpha S
Type:
G Protein-Coupled Receptor (GPCR)
Mol. Mass.:
40567.22
Organism:
Cavia porcellus (domestic guinea pig)
Description:
For the H2 receptor-binding assays, guinea pig striatum was used.
Residue:
359
  
Inhibitor
Name:
BDBM81542
Synonyms:
Beta-Methylhistamine NSC_565544
Type:
Small organic molecule
Emp. Form.:
C6H11N3
Mol. Mass.:
125.1716
SMILES:
CC(CN)c1cnc[nH]1
: