Target
Homeodomain-interacting protein kinase 2
Ligand
BDBM81551
Substrate
Meas. Tech.
Biochemical Assay
IC50
74±0.0 nM
Kd
9.5±0.0 nM
Citation
 Miduturu, CVDeng, XKwiatkowski, NYang, WBrault, LFilippakopoulos, PChung, EYang, QSchwaller, JKnapp, SKing, RWLee, JDHerrgard, SZarrinkar, PGray, NS High-throughput kinase profiling: a more efficient approach toward the discovery of new kinase inhibitors. Chem Biol 18:868-79 (2011)  
Target
Name:
Homeodomain-interacting protein kinase 2
Synonyms:
HIPK2 Homeodomain-interacting protein kinase 2 | Homeodomain-interacting protein kinase 2 (HIPK2)
Type:
Protein
Mol. Mass.:
131001.90
Organism:
Homo sapiens (Human)
Description:
Q9H2X6
Residue:
1198
  
Inhibitor
Name:
BDBM81551
Synonyms:
Furan thiazolidinediones, A64
Type:
Small organic molecule
Emp. Form.:
C18H18N6O2S
Mol. Mass.:
382.44
SMILES:
N=C1NC(=O)\C(S1)=C/c1c[nH]c(=O)c(c1)-c1ccc(nc1)N1CCNCC1
: