Target
Activated CDC42 kinase 1
Ligand
BDBM50337126
Substrate
Meas. Tech.
Biochemical Assay
Kd
15±0.0 nM
Citation
 Miduturu, CVDeng, XKwiatkowski, NYang, WBrault, LFilippakopoulos, PChung, EYang, QSchwaller, JKnapp, SKing, RWLee, JDHerrgard, SZarrinkar, PGray, NS High-throughput kinase profiling: a more efficient approach toward the discovery of new kinase inhibitors. Chem Biol 18:868-79 (2011)  
Target
Name:
Activated CDC42 kinase 1
Synonyms:
ACK1 Activated CDC42 kinase 1 (ACK-1) Tyrosine kinase non-receptor protein 2
Type:
Protein
Mol. Mass.:
114577.86
Organism:
Homo sapiens (Human)
Description:
Q07912
Residue:
1038
  
Inhibitor
Name:
BDBM50337126
Synonyms:
2-(2-methoxy-4-(4-methylpiperazin-1-yl)phenylamino)-11-methyl-5H-benzo[e]pyrimido[5,4-b][1,4]diazepin-6(11H)-one Scaffold, B19 | US9266890, IV-2
Type:
Small organic molecule
Emp. Form.:
C24H27N7O2
Mol. Mass.:
445.5169
SMILES:
COc1cc(ccc1Nc1ncc2NC(=O)c3ccccc3N(C)c2n1)N1CCN(C)CC1
: