Target
Bis(5'-adenosyl)-triphosphatase
Ligand
BDBM81581
Substrate
Meas. Tech.
Enzyme Inhibition Assay
Ki
3300±0.0 nM
Citation
 Varnum, JMBaraniak, JKaczmarek, RStec, WJBrenner, C Di-, tri- and tetra-5'-O-phosphorothioadenosyl substituted polyols as inhibitors of Fhit: Importance of the alpha-beta bridging oxygen and beta phosphorus replacement. BMC Chem Biol 1:3 (2001)  
Target
Name:
Bis(5'-adenosyl)-triphosphatase
Synonyms:
AP3A hydrolase Bis(5'adenosyl)-triphosphatase FHIT Fragile histidine triad protein
Type:
Protein
Mol. Mass.:
16861.00
Organism:
Homo sapiens (Human)
Description:
P49789
Residue:
147
  
Inhibitor
Name:
BDBM81581
Synonyms:
AppppA analog, 10 (X=S)
Type:
Small organic molecule
Emp. Form.:
C23H32N12O10P2S2
Mol. Mass.:
762.653
SMILES:
Nc1ncnc2n(cnc12)[C@@H]1OC(COP([O-])(=S)NCCCNP([S-])(=O)OC[C@H]2OC([C@H](O)[C@@H]2O)n2cnc3c(N)ncnc23)[C@@H](O)[C@H]1O
: