Target
Serine/threonine-protein kinase D3
Ligand
BDBM32334
Substrate
Meas. Tech.
In Vitro Radiometric Kinase Assay
pH
7.5±0
Temperature
303.15±0 K
IC50
227±24 nM
Citation
 Lavalle, CRBravo-Altamirano, KGiridhar, KVChen, JSharlow, ELazo, JSWipf, PWang, QJ Novel protein kinase D inhibitors cause potent arrest in prostate cancer cell growth and motility. BMC Chem Biol 10:5 (2010)  
Target
Name:
Serine/threonine-protein kinase D3
Synonyms:
EPK2 PRKCN Protein kinase C nu Protein kinase C, PKC Protein kinase EPK2 classical/novel | nPKC-nu
Type:
Enzyme Catalytic Domain
Mol. Mass.:
100475.64
Organism:
Homo sapiens (Human)
Description:
gi_5031689
Residue:
890
  
Inhibitor
Name:
BDBM32334
Synonyms:
7-hydroxy-2,3,4,5-tetrahydro-1H-[1]benzofuro[2,3-c]azepin-1-one 7-hydroxy-2,3,4,5-tetrahydrobenzofur[2,3-c]azepin-1-one 7-oxidanyl-2,3,4,5-tetrahydro-[1]benzofuro[2,3-c]azepin-1-one SMR000019965 | cid_755673
Type:
Small organic molecule
Emp. Form.:
C12H11NO3
Mol. Mass.:
217.2206
SMILES:
Oc1ccc2oc3c(CCCNC3=O)c2c1
: