Target
Tubulin alpha-1A chain
Ligand
BDBM81757
Substrate
Meas. Tech.
In Vitro Activity Assay
IC50
7.2e+4± 1.3e+4 nM
Citation
 Morgan, REAhn, SNzimiro, SFotie, JPhelps, MACotrill, JYakovich, AJSackett, DLDalton, JTWerbovetz, KA Inhibitors of tubulin assembly identified through screening a compound library. Chem Biol Drug Des 72:513-24 (2008)  
Target
Name:
Tubulin alpha-1A chain
Synonyms:
TBA1A_PIG Tubulin Tubulin alpha-1A chain
Type:
Protein
Mol. Mass.:
50049.25
Organism:
Sus scrofa (Pig)
Description:
P02550
Residue:
451
  
Inhibitor
Name:
BDBM81757
Synonyms:
Chembridge No 9049411, Class 4, 15
Type:
Small organic molecule
Emp. Form.:
C13H15ClN2O3S2
Mol. Mass.:
346.853
SMILES:
COc1cc(NC(=O)CSC2=NCCS2)c(OC)cc1Cl
: