Target
Muscarinic acetylcholine receptor M2
Ligand
BDBM50062598
Substrate
Ki
25±n/a nM
Comments
PDSP_2045
Citation
 Bolden, CCusack, BRichelson, E Antagonism by antimuscarinic and neuroleptic compounds at the five cloned human muscarinic cholinergic receptors expressed in Chinese hamster ovary cells. J Pharmacol Exp Ther 260:576-80 (1992) Target
Name:
Muscarinic acetylcholine receptor M2
Synonyms:
ACM2_HUMAN Cholinergic, muscarinic M2 Muscarinic acetylcholine receptor M2 and M5 | RecName: Full=Muscarinic acetylcholine receptor M2
Type:
GPCR
Mol. Mass.:
51730.61
Organism:
Homo sapiens (Human)
Description:
P08172
Residue:
466
  
Inhibitor
Name:
BDBM50062598
Synonyms:
1-Cyclohexyl-1-phenyl-3-pyrrolidin-1-yl-propan-1-ol KEMADRIN | PROCYCLIDINE
Type:
Small organic molecule
Emp. Form.:
C19H29NO
Mol. Mass.:
287.4397
SMILES:
OC(CCN1CCCC1)(C1CCCCC1)c1ccccc1
: