Target
Muscarinic acetylcholine receptor M3
Ligand
BDBM81770
Substrate
Ki
530±n/a nM
Comments
PDSP_1797
Citation
 Bolden, CCusack, BRichelson, E Antagonism by antimuscarinic and neuroleptic compounds at the five cloned human muscarinic cholinergic receptors expressed in Chinese hamster ovary cells. J Pharmacol Exp Ther 260:576-80 (1992) Target
Name:
Muscarinic acetylcholine receptor M3
Synonyms:
ACM3_HUMAN Cholinergic, muscarinic M3 Muscarinic receptor M3 | RecName: Full=Muscarinic acetylcholine receptor M3
Type:
Enzyme
Mol. Mass.:
66151.03
Organism:
Homo sapiens (Human)
Description:
P20309
Residue:
590
  
Inhibitor
Name:
BDBM81770
Synonyms:
CAS_82650-83-7 TENILAPINE
Type:
Small organic molecule
Emp. Form.:
C17H16N4S2
Mol. Mass.:
340.466
SMILES:
CN1CCN(CC1)C1=Nc2cscc2C(=CC#N)c2cscc12
: