Target
Muscarinic acetylcholine receptor M4
Ligand
BDBM81484
Substrate
Ki
1700±n/a nM
Comments
PDSP_428
Citation
 Bolden, CCusack, BRichelson, E Antagonism by antimuscarinic and neuroleptic compounds at the five cloned human muscarinic cholinergic receptors expressed in Chinese hamster ovary cells. J Pharmacol Exp Ther 260:576-80 (1992) Target
Name:
Muscarinic acetylcholine receptor M4
Synonyms:
ACM4_HUMAN Cholinergic, muscarinic M4 Muscarinic acetylcholine receptor M2 and M4
Type:
Enzyme Catalytic Domain
Mol. Mass.:
53079.31
Organism:
Homo sapiens (Human)
Description:
Cholinergic, muscarinic M4 CHRM4 HUMAN M3::P08173
Residue:
479
  
Inhibitor
Name:
BDBM81484
Synonyms:
BROMPERIDOL CAS_2448 | NSC_2448
Type:
Small organic molecule
Emp. Form.:
C21H23BrFNO2
Mol. Mass.:
420.315
SMILES:
OC1(CCN(CCCC(=O)c2ccc(F)cc2)CC1)c1ccc(Br)cc1
: