Target
Gamma-aminobutyric acid receptor subunit alpha-1
Ligand
BDBM50010685
Substrate
Ki
>10000±n/a nM
Comments
PDSP_664
Citation
 Mottola, DMBrewster, WKCook, LLNichols, DEMailman, RB Dihydrexidine, a novel full efficacy D1 dopamine receptor agonist. J Pharmacol Exp Ther 262:383-93 (1992) Target
Name:
Gamma-aminobutyric acid receptor subunit alpha-1
Synonyms:
Benzodiazepine central GABA A Benzodiazepine GABA A Benzodiazepine Type II GABA A Benzodiazepine Type IIM GABA A Benzodiazepine omega2 GABA A alpha1 GABA receptor alpha-1 subunit GABA-PICROTOXIN Gabra-1 TBPS
Type:
Enzyme
Mol. Mass.:
51770.21
Organism:
Rattus norvegicus (Rat)
Description:
P62813
Residue:
455
  
Inhibitor
Name:
BDBM50010685
Synonyms:
(+/-)-trans-10,11-dihydroxy-5,6,6a,7,8,12b-hexahydrobenzo[a]phenanthridine 5,6,6a,7,8,12b-Hexahydro-benzo[a]phenanthridine-10,11-diol Dihydrexidine, DHX
Type:
Small organic molecule
Emp. Form.:
C17H17NO2
Mol. Mass.:
267.3224
SMILES:
Oc1cc2CC[C@H]3NCc4ccccc4[C@H]3c2cc1O
: