Target
Alpha-2B adrenergic receptor
Ligand
BDBM50030622
Substrate
Ki
116±n/a nM
Comments
PDSP_335
Citation
 Bylund, DBBlaxall, HSIversen, LJCaron, MGLefkowitz, RJLomasney, JW Pharmacological characteristics of alpha 2-adrenergic receptors: comparison of pharmacologically defined subtypes with subtypes identified by molecular cloning. Mol Pharmacol 42:1-5 (1992) Target
Name:
Alpha-2B adrenergic receptor
Synonyms:
ADA2B_HUMAN ADRA2L1 Adrenergic alpha2B Adrenergic receptor alpha Alpha-2 adrenergic receptor subtype C2 Alpha-2B adrenoreceptor | Alpha-2BAR
Type:
Enzyme
Mol. Mass.:
49964.20
Organism:
Homo sapiens (Human)
Description:
P18089
Residue:
450
  
Inhibitor
Name:
BDBM50030622
Synonyms:
(7aS,8S,11aS,12aR)-8-Methyl-5,6,7a,8,11a,12,12a,13-octahydro-7H-9-oxa-6a,13-diaza-indeno[2,1-a]anthracene-11-carboxylic acid methyl ester CHEMBL122404
Type:
Small organic molecule
Emp. Form.:
C21H24N2O3
Mol. Mass.:
352.4269
SMILES:
COC(=O)C1=CO[C@@H](C)[C@@H]2CN3CCc4c([nH]c5ccccc45)[C@H]3C[C@H]12
: