Target
Alpha-2B adrenergic receptor
Ligand
BDBM30993
Substrate
Ki
14.5±n/a nM
Comments
PDSP_1589
Citation
 Bylund, DBBlaxall, HSIversen, LJCaron, MGLefkowitz, RJLomasney, JW Pharmacological characteristics of alpha 2-adrenergic receptors: comparison of pharmacologically defined subtypes with subtypes identified by molecular cloning. Mol Pharmacol 42:1-5 (1992) Target
Name:
Alpha-2B adrenergic receptor
Synonyms:
ADA2B_HUMAN ADRA2L1 Adrenergic alpha2B Adrenergic receptor alpha Alpha-2 adrenergic receptor subtype C2 Alpha-2B adrenoreceptor | Alpha-2BAR
Type:
Enzyme
Mol. Mass.:
49964.20
Organism:
Homo sapiens (Human)
Description:
P18089
Residue:
450
  
Inhibitor
Name:
BDBM30993
Synonyms:
Ajmalicine Raubasine cid_251561
Type:
Small organic molecule
Emp. Form.:
C21H24N2O3
Mol. Mass.:
352.4269
SMILES:
COC(=O)C1=COC(C)C2CN3CCc4c([nH]c5ccccc45)C3CC12
: