Target
Alpha-2C adrenergic receptor
Ligand
BDBM50013515
Substrate
Ki
0.19±n/a nM
Comments
PDSP_1987
Citation
 Bylund, DBBlaxall, HSIversen, LJCaron, MGLefkowitz, RJLomasney, JW Pharmacological characteristics of alpha 2-adrenergic receptors: comparison of pharmacologically defined subtypes with subtypes identified by molecular cloning. Mol Pharmacol 42:1-5 (1992) Target
Name:
Alpha-2C adrenergic receptor
Synonyms:
ADRA2C | adrenergic Alpha2C
Type:
Enzyme Catalytic Domain
Mol. Mass.:
27257.01
Organism:
OK
Description:
adrenergic Alpha2C ADRA2C OK::G3GWB4
Residue:
230
  
Inhibitor
Name:
BDBM50013515
Synonyms:
(+)-yohimbine 17alpha-hydroxyyohimban-16alpha-carboxylic acid methyl ester CORYNANTHINE Quebrachin YOHIMBINE CHLORIDE Yohimbine cid_8969 methyl 17alpha-hydroxyyohimban-16alpha-carboxylate yohimbic acid methyl ester
Type:
Small organic molecule
Emp. Form.:
C21H26N2O3
Mol. Mass.:
354.4427
SMILES:
COC(=O)[C@H]1[C@@H](O)CC[C@H]2CN3CCc4c([nH]c5ccccc45)[C@@H]3C[C@H]12
: