Target
D(2) dopamine receptor
Ligand
BDBM81195
Substrate
Ki
24±n/a nM
Comments
PDSP_241
Citation
 Levant, BGrigoriadis, DEDeSouza, EB Characterization of [3H]quinpirole binding to D2-like dopamine receptors in rat brain. J Pharmacol Exp Ther 262:929-35 (1992) Target
Name:
D(2) dopamine receptor
Synonyms:
DOPAMINE D2 DOPAMINE D2 Short Dopamine D2 receptor Drd2
Type:
G Protein-Coupled Receptor (GPCR)
Mol. Mass.:
50931.60
Organism:
Rattus norvegicus (rat)
Description:
P61169
Residue:
444
  
Inhibitor
Name:
BDBM81195
Synonyms:
(+/-)-2-Amino-6,7-dihydroxy-1,2,3,4-tetrahydronaphthalene hydrobromide 6-Amino-5,6,7,8-tetrahydro-naphthalene-2,3-diol 6-azanyl-5,6,7,8-tetrahydronaphthalene-2,3-diol;hydrobromide ADTN, (+) CHEMBL26736 SMR001254097 cid_3153
Type:
Small organic molecule
Emp. Form.:
C10H13NO2
Mol. Mass.:
179.2157
SMILES:
NC1CCc2cc(O)c(O)cc2C1
: