Target
D(3) dopamine receptor
Ligand
BDBM81790
Substrate
Ki
2.4±n/a nM
Comments
PDSP_287
Citation
 Sokoloff, PGiros, BMartres, MPAndrieux, MBesancon, RPilon, CBouthenet, MLSouil, ESchwartz, JC Localization and function of the D3 dopamine receptor. Arzneimittelforschung 42:224-30 (1992) Target
Name:
D(3) dopamine receptor
Synonyms:
DOPAMINE D3 DRD3_HUMAN Dopamine D3 receptor (D3) Dopamine receptor Dopamine receptor D3
Type:
Mol. Mass.:
44243.43
Organism:
Homo sapiens (Human)
Description:
Residue:
400
  
Inhibitor
Name:
BDBM81790
Synonyms:
Amisulpride NSC_2159 US10259786, Amisulpride
Type:
Small organic molecule
Emp. Form.:
C17H27N3O4S
Mol. Mass.:
369.479
SMILES:
CCN1CCCC1CNC(=O)c1cc(c(N)cc1OC)S(=O)(=O)CC
: