Target
Gamma-aminobutyric acid receptor subunit alpha-1
Ligand
BDBM50019213
Substrate
Ki
>10000±n/a nM
Comments
PDSP_543
Citation
 Awad, MGavish, M Peripheral-type benzodiazepine receptors in human cerebral cortex, kidney, and colon. Life Sci 49:1155-61 (1991)  
Target
Name:
Gamma-aminobutyric acid receptor subunit alpha-1
Synonyms:
Benzodiazepine central GABA A Benzodiazepine GABA A Benzodiazepine Type II GABA A Benzodiazepine Type IIM GABA A Benzodiazepine omega2 GABA A alpha1 GABA receptor alpha-1 subunit GABA-PICROTOXIN Gabra-1 TBPS
Type:
Enzyme
Mol. Mass.:
51770.21
Organism:
Rattus norvegicus (Rat)
Description:
P62813
Residue:
455
  
Inhibitor
Name:
BDBM50019213
Synonyms:
1,3-dihydro-7-nitro-5-(2-chlorophenyl)-2H-1,4.benzodiazepin-2-one 5-(o-chlorophenyl)-7-nitro-1,3-dihydro-2H-1,4-benzodiazepin-2-one CLONAZEPAM
Type:
Small organic molecule
Emp. Form.:
C15H10ClN3O3
Mol. Mass.:
315.711
SMILES:
[O-][N+](=O)c1ccc2NC(=O)CN=C(c3ccccc3Cl)c2c1
: