Target
Gamma-aminobutyric acid receptor subunit alpha-1
Ligand
BDBM22032
Substrate
Ki
8±n/a nM
Comments
PDSP_1506
Citation
 Awad, MGavish, M Peripheral-type benzodiazepine receptors in human cerebral cortex, kidney, and colon. Life Sci 49:1155-61 (1991)  
Target
Name:
Gamma-aminobutyric acid receptor subunit alpha-1
Synonyms:
Benzodiazepine central GABA A Benzodiazepine liver GABA(A) receptor subunit alpha-1 GABA-A receptor GBRA1_HUMAN TBPS | agonist GABA site
Type:
Protein
Mol. Mass.:
51817.35
Organism:
Homo sapiens (Human)
Description:
P14867
Residue:
456
  
Inhibitor
Name:
BDBM22032
Synonyms:
1-(2-chlorophenyl)-N-methyl-N-(1-methylpropyl)isoquinoline-3-carboxamide N-(butan-2-yl)-1-(2-chlorophenyl)-N-methylisoquinoline-3-carboxamide PK-11195 RP 52028 | [3H]PK 11195
Type:
radiolabeled ligand
Emp. Form.:
C21H21ClN2O
Mol. Mass.:
352.857
SMILES:
CCC(C)N(C)C(=O)c1cc2ccccc2c(n1)-c1ccccc1Cl
: