Target
Alpha-2A adrenergic receptor
Ligand
BDBM50240671
Substrate
Ki
62±n/a nM
Comments
PDSP_1862
Citation
 Blaxall, HSMurphy, TJBaker, JCRay, CBylund, DB Characterization of the alpha-2C adrenergic receptor subtype in the opossum kidney and in the OK cell line. J Pharmacol Exp Ther 259:323-9 (1991) Target
Name:
Alpha-2A adrenergic receptor
Synonyms:
ADA2A_HUMAN ADRA2R Adrenergic alpha2A Alpha-2 adrenergic receptor subtype C10 Alpha-2A adrenoreceptor alpha-2A adrenergic receptor [Homo sapiens]
Type:
Enzyme
Mol. Mass.:
48979.91
Organism:
Homo sapiens (Human)
Description:
P08913
Residue:
465
  
Inhibitor
Name:
BDBM50240671
Synonyms:
(5-Chloro-benzo[1,2,5]thiadiazol-4-yl)-(4,5-dihydro-1H-imidazol-2-yl)-amine TIZANIDINE | Zanaflex
Type:
Small organic molecule
Emp. Form.:
C9H8ClN5S
Mol. Mass.:
253.711
SMILES:
Clc1ccc2nsnc2c1NC1=NCCN1
: