Target
Alpha-2B adrenergic receptor
Ligand
BDBM66983
Substrate
Ki
1.8±n/a nM
Comments
PDSP_1727
Citation
 Blaxall, HSMurphy, TJBaker, JCRay, CBylund, DB Characterization of the alpha-2C adrenergic receptor subtype in the opossum kidney and in the OK cell line. J Pharmacol Exp Ther 259:323-9 (1991) Target
Name:
Alpha-2B adrenergic receptor
Synonyms:
ADA2B_RAT Adrenergic receptor alpha Alpha-2B adrenergic receptor Alpha-2B adrenoreceptor | adrenergic Alpha2B
Type:
Enzyme Catalytic Domain
Mol. Mass.:
50379.83
Organism:
NEONATAL RAT
Description:
adrenergic Alpha2B ADRA2B NEONATAL RAT::P19328
Residue:
453
  
Inhibitor
Name:
BDBM66983
Synonyms:
6-chloranyl-3-methyl-1,2,4,5-tetrahydro-3-benzazepine;hydrochloride CHEMBL123349 SKF 86466 SMR001254100 | cid_10220250
Type:
Small organic molecule
Emp. Form.:
C11H14ClN
Mol. Mass.:
195.689
SMILES:
CN1CCc2cccc(Cl)c2CC1
: