Target
Alpha-2C adrenergic receptor
Ligand
BDBM60917
Substrate
Ki
22±n/a nM
Comments
PDSP_812
Citation
 Blaxall, HSMurphy, TJBaker, JCRay, CBylund, DB Characterization of the alpha-2C adrenergic receptor subtype in the opossum kidney and in the OK cell line. J Pharmacol Exp Ther 259:323-9 (1991) Target
Name:
Alpha-2C adrenergic receptor
Synonyms:
ADRA2C | adrenergic Alpha2C
Type:
Enzyme Catalytic Domain
Mol. Mass.:
27257.01
Organism:
OK
Description:
adrenergic Alpha2C ADRA2C OK::G3GWB4
Residue:
230
  
Inhibitor
Name:
BDBM60917
Synonyms:
9-chloranyl-5-(4-hydroxyphenyl)-2,3,4,5-tetrahydro-1H-3-benzazepine-7,8-diol;methanesulfonic acid 9-chloro-5-(4-hydroxyphenyl)-2,3,4,5-tetrahydro-1H-3-benzazepine-7,8-diol;methanesulfonic acid FENOLDOPAM MESYLATE SMR000469190 | cid_49659
Type:
Small organic molecule
Emp. Form.:
C16H16ClNO3
Mol. Mass.:
305.756
SMILES:
Oc1ccc(cc1)C1CNCCc2c(Cl)c(O)c(O)cc12
: