Target
Alpha-2C adrenergic receptor
Ligand
BDBM35256
Substrate
Ki
4.5±n/a nM
Comments
PDSP_1235
Citation
 Blaxall, HSMurphy, TJBaker, JCRay, CBylund, DB Characterization of the alpha-2C adrenergic receptor subtype in the opossum kidney and in the OK cell line. J Pharmacol Exp Ther 259:323-9 (1991) Target
Name:
Alpha-2C adrenergic receptor
Synonyms:
ADA2C_DIDVI Alpha-2C adrenergic receptor | adrenergic Alpha2C
Type:
Enzyme Catalytic Domain
Mol. Mass.:
53254.77
Organism:
OPOSSUM
Description:
adrenergic Alpha2C ADRA2C OPOSSUM::P35405
Residue:
469
  
Inhibitor
Name:
BDBM35256
Synonyms:
(S)-mianserin MIANSERIN MIANSERIN (-) | Tolvon
Type:
Small organic molecule
Emp. Form.:
C18H20N2
Mol. Mass.:
264.3648
SMILES:
[H][C@]12CN(C)CCN1c1ccccc1Cc1ccccc21
: