Target
Alpha-2C adrenergic receptor
Ligand
BDBM81810
Substrate
Ki
0.56±n/a nM
Comments
PDSP_1968
Citation
 Blaxall, HSMurphy, TJBaker, JCRay, CBylund, DB Characterization of the alpha-2C adrenergic receptor subtype in the opossum kidney and in the OK cell line. J Pharmacol Exp Ther 259:323-9 (1991) Target
Name:
Alpha-2C adrenergic receptor
Synonyms:
ADRA2C | adrenergic Alpha2C
Type:
Enzyme Catalytic Domain
Mol. Mass.:
27257.01
Organism:
OK
Description:
adrenergic Alpha2C ADRA2C OK::G3GWB4
Residue:
230
  
Inhibitor
Name:
BDBM81810
Synonyms:
CAS_125697 WY 27127
Type:
Small organic molecule
Emp. Form.:
C17H27N3O4S2
Mol. Mass.:
401.544
SMILES:
CS(=O)(=O)NCCN(C1CCN2CCc3ccccc3C2C1)S(C)(=O)=O
: