Target
Calcium release-activated calcium channel protein 1
Ligand
BDBM81819
Substrate
Ki
2700±n/a nM
Comments
PDSP_2652
Citation
 Garritsen, AIjzerman, APTulp, MTCragoe, EJSoudijn, W Receptor binding profiles of amiloride analogues provide no evidence for a link between receptors and the Na+/H+ exchanger, but indicate a common structure on receptor proteins. J Recept Res 11:891-907 (1991)  
Target
Name:
Calcium release-activated calcium channel protein 1
Synonyms:
CRACM1 Calcium channel (VER) Calcium release-activated calcium channel protein 1 Protein orai-1 Transmembrane protein 142A
Type:
Protein
Mol. Mass.:
32676.63
Organism:
Homo sapiens (Human)
Description:
Q96D31
Residue:
301
  
Inhibitor
Name:
BDBM81819
Synonyms:
Benzamil CHEMBL212579 | NSC_108107
Type:
Small organic molecule
Emp. Form.:
C13H14ClN7O
Mol. Mass.:
319.75
SMILES:
NC(NC(=O)c1nc(Cl)c(N)nc1N)=NCc1ccccc1
: