Target
Gastrin/cholecystokinin type B receptor
Ligand
BDBM81818
Substrate
Ki
>10000±n/a nM
Comments
PDSP_2651
Citation
 Garritsen, AIjzerman, APTulp, MTCragoe, EJSoudijn, W Receptor binding profiles of amiloride analogues provide no evidence for a link between receptors and the Na+/H+ exchanger, but indicate a common structure on receptor proteins. J Recept Res 11:891-907 (1991)  
Target
Name:
Gastrin/cholecystokinin type B receptor
Synonyms:
Cckbr Cholecystokinin B receptor GASR_RAT | Gastrin/cholecystokinin type B receptor
Type:
Enzyme Catalytic Domain
Mol. Mass.:
48980.43
Organism:
RAT
Description:
Cholecystokinin A CCKBR RAT::P30553
Residue:
452
  
Inhibitor
Name:
BDBM81818
Synonyms:
CAS_1794 HMA | NSC_1794
Type:
Small organic molecule
Emp. Form.:
C12H18ClN7O
Mol. Mass.:
311.771
SMILES:
NC(=N)NC(=O)c1nc(Cl)c(nc1N)N1CCCCCC1
: