Target
Cysteinyl leukotriene receptor 1
Ligand
BDBM81819
Substrate
Ki
>10000±n/a nM
Comments
PDSP_2652
Citation
 Garritsen, AIjzerman, APTulp, MTCragoe, EJSoudijn, W Receptor binding profiles of amiloride analogues provide no evidence for a link between receptors and the Na+/H+ exchanger, but indicate a common structure on receptor proteins. J Recept Res 11:891-907 (1991)  
Target
Name:
Cysteinyl leukotriene receptor 1
Synonyms:
CLTR1_CAVPO | CYSLTR1
Type:
Enzyme Catalytic Domain
Mol. Mass.:
39007.58
Organism:
GUINEA PIG
Description:
Leukotriene D4 0 GUINEA PIG::Q2NNR5
Residue:
340
  
Inhibitor
Name:
BDBM81819
Synonyms:
Benzamil CHEMBL212579 | NSC_108107
Type:
Small organic molecule
Emp. Form.:
C13H14ClN7O
Mol. Mass.:
319.75
SMILES:
NC(NC(=O)c1nc(Cl)c(N)nc1N)=NCc1ccccc1
: