Target
Alpha-1A adrenergic receptor
Ligand
BDBM50033113
Substrate
Ki
611±n/a nM
Comments
PDSP_977
Citation
 Lomasney, JWCotecchia, SLorenz, WLeung, WYSchwinn, DAYang-Feng, TLBrownstein, MLefkowitz, RJCaron, MG Molecular cloning and expression of the cDNA for the alpha 1A-adrenergic receptor. The gene for which is located on human chromosome 5. J Biol Chem 266:6365-9 (1991) Target
Name:
Alpha-1A adrenergic receptor
Synonyms:
ADA1A_RAT Adra1c Alpha-1A adrenoceptor Alpha-1C adrenergic receptor | adrenergic Alpha1A
Type:
Protein
Mol. Mass.:
51620.15
Organism:
Rattus norvegicus (Rat)
Description:
P43140
Residue:
466
  
Inhibitor
Name:
BDBM50033113
Synonyms:
CHEMBL279516 INDORAMINE N-{1-[2-(1H-Indol-3-yl)-ethyl]-piperidin-4-yl}-benzamide N-{1-[2-(1H-Indol-3-yl)-ethyl]-piperidin-4-yl}-benzamide(indoramin)
Type:
Small organic molecule
Emp. Form.:
C22H25N3O
Mol. Mass.:
347.4534
SMILES:
O=C(NC1CCN(CCc2c[nH]c3ccccc23)CC1)c1ccccc1
: