Target
5-hydroxytryptamine receptor 1B
Ligand
BDBM21392
Substrate
Ki
4±n/a nM
Comments
PDSP_140
Citation
 Matsumoto, ICombs, MRJones, DJ Characterization of 5-hydroxytryptamine1B receptors in rat spinal cord via [125I]iodocyanopindolol binding and inhibition of [3H]-5-hydroxytryptamine release. J Pharmacol Exp Ther 260:614-26 (1992) Target
Name:
5-hydroxytryptamine receptor 1B
Synonyms:
5-HT-1B 5-hydroxytryptamine receptor 1B (5HT1B) 5ht1b Serotonin 1 (5-HT1) receptor Serotonin receptor 1B
Type:
Protein
Mol. Mass.:
43173.33
Organism:
Rattus norvegicus (Rat)
Description:
P28564
Residue:
386
  
Inhibitor
Name:
BDBM21392
Synonyms:
3-(2-aminoethyl)-1H-indole-5-carboxamide 5-CT,DP CHEMBL1256863 [3H]-5-CT [3H]-5-Carboxyamidotryptamine | [3H]-5-carboxamidotryptamine
Type:
Small organic molecule
Emp. Form.:
C11H13N3O
Mol. Mass.:
203.2404
SMILES:
NCCc1c[nH]c2ccc(cc12)C(N)=O
: