Target
5-hydroxytryptamine receptor 1B
Ligand
BDBM50007406
Substrate
Ki
84±n/a nM
Comments
PDSP_1808
Citation
 Matsumoto, ICombs, MRJones, DJ Characterization of 5-hydroxytryptamine1B receptors in rat spinal cord via [125I]iodocyanopindolol binding and inhibition of [3H]-5-hydroxytryptamine release. J Pharmacol Exp Ther 260:614-26 (1992) Target
Name:
5-hydroxytryptamine receptor 1B
Synonyms:
5-HT-1B 5-hydroxytryptamine receptor 1B (5HT1B) 5ht1b Serotonin 1 (5-HT1) receptor Serotonin receptor 1B
Type:
Protein
Mol. Mass.:
43173.33
Organism:
Rattus norvegicus (Rat)
Description:
P28564
Residue:
386
  
Inhibitor
Name:
BDBM50007406
Synonyms:
1-(3-(trifluoromethyl)phenyl)piperazine 1-(3-Trifluoromethyl-phenyl)-piperazine(TFMPP) TFMPP
Type:
Small organic molecule
Emp. Form.:
C11H13F3N2
Mol. Mass.:
230.2295
SMILES:
FC(F)(F)c1cccc(c1)N1CCNCC1
: