Target
D(1B) dopamine receptor
Ligand
BDBM55121
Substrate
Ki
3900±n/a nM
Comments
PDSP_728
Citation
 Tiberi, MJarvie, KRSilvia, CFalardeau, PGingrich, JAGodinot, NBertrand, LYang-Feng, TLFremeau, RTCaron, MG Cloning, molecular characterization, and chromosomal assignment of a gene encoding a second D1 dopamine receptor subtype: differential expression pattern in rat brain compared with the D1A receptor. Proc Natl Acad Sci U S A 88:7491-5 (1991)  
Target
Name:
D(1B) dopamine receptor
Synonyms:
D(1B) dopamine receptor DRD5_RAT Dopamine D5 receptor Drd5
Type:
Enzyme Catalytic Domain
Mol. Mass.:
52827.88
Organism:
RAT
Description:
Dopamine D1B 0 RAT::P25115
Residue:
475
  
Inhibitor
Name:
BDBM55121
Synonyms:
3-HYDROXYTYRAMINE HYDROCHLORIDE 4-(2-aminoethyl)pyrocatechol;hydrochloride Dopamine SMR000059081 | cid_65340
Type:
Small organic molecule
Emp. Form.:
C8H11NO2
Mol. Mass.:
153.1784
SMILES:
NCCc1ccc(O)c(O)c1
: