Target
Dopamine receptor D4
Ligand
BDBM81872
Substrate
Ki
0.4±n/a nM
Comments
PDSP_794
Citation
 Van Tol, HHBunzow, JRGuan, HCSunahara, RKSeeman, PNiznik, HBCivelli, O Cloning of the gene for a human dopamine D4 receptor with high affinity for the antipsychotic clozapine. Nature 350:610-4 (1991)  
Target
Name:
Dopamine receptor D4
Synonyms:
DOPAMINE D2 Long DRD2 | Dopamine receptor D4
Type:
Enzyme Catalytic Domain
Mol. Mass.:
43731.97
Organism:
CANINE
Description:
Q589Y6
Residue:
421
  
Inhibitor
Name:
BDBM81872
Synonyms:
CAS_161309 NSC_161309
Type:
Small organic molecule
Emp. Form.:
C32H41N5O5
Mol. Mass.:
575.6984
SMILES:
CCC(C)C1N2C(=O)C(NC(=O)C3CN(C)C4Cc5c[nH]c6cccc(C4=C3)c56)(OC2(O)C2CCCN2C1=O)C(C)C
: