Target
D(2) dopamine receptor
Ligand
BDBM81774
Substrate
Ki
46±n/a nM
Comments
PDSP_1785
Citation
 Van Tol, HHBunzow, JRGuan, HCSunahara, RKSeeman, PNiznik, HBCivelli, O Cloning of the gene for a human dopamine D4 receptor with high affinity for the antipsychotic clozapine. Nature 350:610-4 (1991)  
Target
Name:
D(2) dopamine receptor
Synonyms:
D(2) dopamine receptor DOPAMINE D2 Long DRD2 Dopamine D2 receptor Dopamine D2 receptor (D2R) Dopamine2-like | d2
Type:
Cell-surface receptors
Mol. Mass.:
50647.10
Organism:
Homo sapiens (Human)
Description:
P14416
Residue:
443
  
Inhibitor
Name:
BDBM81774
Synonyms:
CAS_15676-16-1 Sulpiride-S | Sulpiride-l
Type:
Emp. Form.:
C15H23N3O4S
Mol. Mass.:
341.426
SMILES:
CCN1CCC[C@H]1CNC(=O)c1cc(ccc1OC)S(N)(=O)=O
: