Target
D(2) dopamine receptor
Ligand
BDBM50002338
Substrate
Ki
3.3±n/a nM
Comments
PDSP_1849
Citation
 Van Tol, HHBunzow, JRGuan, HCSunahara, RKSeeman, PNiznik, HBCivelli, O Cloning of the gene for a human dopamine D4 receptor with high affinity for the antipsychotic clozapine. Nature 350:610-4 (1991)  
Target
Name:
D(2) dopamine receptor
Synonyms:
DOPAMINE D2 DOPAMINE D2 Short Dopamine D2 receptor Drd2
Type:
G Protein-Coupled Receptor (GPCR)
Mol. Mass.:
50931.60
Organism:
Rattus norvegicus (rat)
Description:
P61169
Residue:
444
  
Inhibitor
Name:
BDBM50002338
Synonyms:
(Thioridazine)10-[2-(1-Methyl-piperidin-2-yl)-ethyl]-2-methylsulfanyl-10H-phenothiazine 10-[2-(1-Methyl-piperidin-2-yl)-ethyl]-2-methylsulfanyl-10H-phenothiazine CHEMBL479 MELLARIL-S TP-21 | US9504692, Thioridazine
Type:
Small organic molecule
Emp. Form.:
C21H26N2S2
Mol. Mass.:
370.575
SMILES:
CSc1ccc2Sc3ccccc3N(CCC3CCCCN3C)c2c1
: