Target
D(4) dopamine receptor
Ligand
BDBM82247
Substrate
Ki
3560±n/a nM
Comments
PDSP_1685
Citation
 Van Tol, HHBunzow, JRGuan, HCSunahara, RKSeeman, PNiznik, HBCivelli, O Cloning of the gene for a human dopamine D4 receptor with high affinity for the antipsychotic clozapine. Nature 350:610-4 (1991)  
Target
Name:
D(4) dopamine receptor
Synonyms:
D(2C) dopamine receptor DOPAMINE D4.2 DRD4 Dopamine D4 receptor
Type:
Enzyme
Mol. Mass.:
48373.19
Organism:
Homo sapiens (Human)
Description:
P21917
Residue:
419
  
Inhibitor
Name:
BDBM82247
Synonyms:
8-Chloro-3-methyl-5-phenyl-2,3,4,5-tetrahydro-1H-benzo[d]azepin-7-ol(SCH 23390) CHEMBL2158641 SCH 23388 SCH 23390 (R-enantiomer) | SCH 23390,R(+)
Type:
Small organic molecule
Emp. Form.:
C17H18ClNO
Mol. Mass.:
287.784
SMILES:
CN1CCc2cc(Cl)c(O)cc2[C@H](C1)c1ccccc1
: