Target
5-hydroxytryptamine receptor 1B
Ligand
BDBM50029150
Substrate
Ki
4466.83±n/a nM
Comments
PDSP_976
Citation
 Wong, DTThrelkeld, PGRobertson, DW Affinities of fluoxetine, its enantiomers, and other inhibitors of serotonin uptake for subtypes of serotonin receptors. Neuropsychopharmacology 5:43-7 (1991) Target
Name:
5-hydroxytryptamine receptor 1B
Synonyms:
5-HT-1B 5-hydroxytryptamine receptor 1B (5HT1B) 5ht1b Serotonin 1 (5-HT1) receptor Serotonin receptor 1B
Type:
Protein
Mol. Mass.:
43173.33
Organism:
Rattus norvegicus (Rat)
Description:
P28564
Residue:
386
  
Inhibitor
Name:
BDBM50029150
Synonyms:
3-(2-Piperidin-4-yl-ethyl)-1H-indole Indalpine
Type:
Small organic molecule
Emp. Form.:
C15H20N2
Mol. Mass.:
228.3327
SMILES:
C(Cc1c[nH]c2ccccc12)C1CCNCC1
: