Target
Glutamate receptor ionotropic, NMDA 1
Ligand
BDBM50004852
Substrate
Ki
200±n/a nM
Comments
PDSP_3404
Citation
 Madsen, UFerkany, JWJones, BEEbert, BJohansen, TNHolm, TKrogsgaard-Larsen, P NMDA receptor agonists derived from ibotenic acid. Preparation, neuroexcitation and neurotoxicity. Eur J Pharmacol 189:381-91 (1990)  
Target
Name:
Glutamate receptor ionotropic, NMDA 1
Synonyms:
Glutamate (NMDA) receptor subunit zeta 1 Glutamate-NMDA-Channel Glutamate-NMDA-Polyamine NMDA Nmdar1 | phencyclidine
Type:
Enzyme Catalytic Domain
Mol. Mass.:
105533.40
Organism:
RAT
Description:
P35439
Residue:
938
  
Inhibitor
Name:
BDBM50004852
Synonyms:
AMAA Amino-(3-hydroxy-5-methyl-isoxazol-4-yl)-acetic acid (D-AMAA) | CHEMBL280585
Type:
Small organic molecule
Emp. Form.:
C6H8N2O4
Mol. Mass.:
172.1387
SMILES:
Cc1o[nH]c(=O)c1C(N)C(O)=O
: