Target
5-hydroxytryptamine receptor 1B
Ligand
BDBM25752
Substrate
Ki
>10000±n/a nM
Comments
PDSP_360
Citation
 Tsuchihashi, HNakashima, YKinami, JNagatomo, T Characteristics of 125I-iodocyanopindolol binding to beta-adrenergic and serotonin-1B receptors of rat brain: selectivity of beta-adrenergic agents. Jpn J Pharmacol 52:195-200 (1990)  
Target
Name:
5-hydroxytryptamine receptor 1B
Synonyms:
5-HT-1B 5-hydroxytryptamine receptor 1B (5HT1B) 5ht1b Serotonin 1 (5-HT1) receptor Serotonin receptor 1B
Type:
Protein
Mol. Mass.:
43173.33
Organism:
Rattus norvegicus (Rat)
Description:
P28564
Residue:
386
  
Inhibitor
Name:
BDBM25752
Synonyms:
Betaxolol [(2S)-3-{4-[2-(cyclopropylmethoxy)ethyl]phenoxy}-2-hydroxypropyl](propan-2-yl)amine
Type:
Small organic molecule
Emp. Form.:
C18H29NO3
Mol. Mass.:
307.4278
SMILES:
CC(C)NC[C@H](O)COc1ccc(CCOCC2CC2)cc1
: