Target
Beta-2 adrenergic receptor
Ligand
BDBM50240370
Substrate
Ki
9.77±n/a nM
Comments
PDSP_1427
Citation
 Tsuchihashi, HNakashima, YKinami, JNagatomo, T Characteristics of 125I-iodocyanopindolol binding to beta-adrenergic and serotonin-1B receptors of rat brain: selectivity of beta-adrenergic agents. Jpn J Pharmacol 52:195-200 (1990)  
Target
Name:
Beta-2 adrenergic receptor
Synonyms:
ADRB2_RAT Adrb2r | Adrenergic receptor beta
Type:
PROTEIN
Mol. Mass.:
46896.26
Organism:
Rattus norvegicus
Description:
ChEMBL_38603
Residue:
418
  
Inhibitor
Name:
BDBM50240370
Synonyms:
1-(2-(allyloxy)phenoxy)-3-(isopropylamino)propan-2-ol 1-(2-Allyloxy-phenoxy)-3-isopropylamino-propan-2-ol (Oxprenolol) CHEMBL546 Trasicor
Type:
Small organic molecule
Emp. Form.:
C15H23NO3
Mol. Mass.:
265.348
SMILES:
CC(C)NCC(O)COc1ccccc1OCC=C
: