Target
D(2) dopamine receptor
Ligand
BDBM81796
Substrate
Ki
0.61±n/a nM
Comments
PDSP_981
Citation
 Sokoloff, PGiros, BMartres, MPBouthenet, MLSchwartz, JC Molecular cloning and characterization of a novel dopamine receptor (D3) as a target for neuroleptics. Nature 347:146-51 (1990)  
Target
Name:
D(2) dopamine receptor
Synonyms:
DOPAMINE D2 DOPAMINE D2 Short Dopamine D2 receptor Drd2
Type:
G Protein-Coupled Receptor (GPCR)
Mol. Mass.:
50931.60
Organism:
Rattus norvegicus (rat)
Description:
P61169
Residue:
444
  
Inhibitor
Name:
BDBM81796
Synonyms:
CAS_122245 NSC_122245
Type:
Small organic molecule
Emp. Form.:
C19H27IN2O4S
Mol. Mass.:
506.398
SMILES:
CCS(=O)(=O)c1cc(C(=O)NCC2CCCN2CC2CC2)c(OC)cc1I
: