Target
Oxytocin receptor
Ligand
BDBM81889
Substrate
Ki
4.1±n/a nM
Comments
PDSP_1039
Citation
 Pettibone, DJClineschmidt, BVLis, EVReiss, DRTotaro, JAWoyden, CJBock, MGFreidinger, RMTung, RDVeber, DF In vitro pharmacological profile of a novel structural class of oxytocin antagonists. J Pharmacol Exp Ther 256:304-8 (1991) Target
Name:
Oxytocin receptor
Synonyms:
OT-R OXYR_HUMAN | Oxytocin
Type:
Enzyme Catalytic Domain
Mol. Mass.:
42793.26
Organism:
Homo sapiens (Human)
Description:
Oxytocin OXTR HEK293::B2R9L7
Residue:
389
  
Inhibitor
Name:
BDBM81889
Synonyms:
Cyclo[L-Pro-D-Phe-L-Ile-1,6-didehydro-D-Pyz-5-[(dimethylamino)methyl]-L-Pyz-N-methyl-D-Phe-] L-366,670
Type:
Small organic molecule
Emp. Form.:
C43H59N9O6
Mol. Mass.:
797.9853
SMILES:
CCC(C)C1NC(=O)[C@H](Cc2ccccc2)NC(=O)[C@H]2CCCN2C(=O)[C@H](Cc2ccccc2)N(C)C(=O)[C@H]2CC(CN(C)C)CNN2C(=O)[C@H]2CCC=NN2C1=O
: