Target
Heat shock protein HSP 90-alpha
Ligand
BDBM81914
Substrate
Meas. Tech.
Competition Assay
pH
7.4±0
IC50
0.1±0.0 nM
Citation
 Feldman, RIMintzer, BZhu, DWu, JMBiroc, SLYuan, SEmayan, KChang, ZChen, DArnaiz, DOBryant, JGe, XSWhitlow, MAdler, MPolokoff, MALi, WWFerrer, MSato, TGu, JMShen, JTseng, JLDinter, HBuckman, B Potent triazolothione inhibitor of heat-shock protein-90. Chem Biol Drug Des 74:43-50 (2009)  
Target
Name:
Heat shock protein HSP 90-alpha
Synonyms:
HS90A_HUMAN HSP86 HSP90AA1 HSPCA Heat shock 86 kDa Heat shock protein HSP 90-alpha (HSP90) LAP-2 Lipopolysaccharide-associated protein 2 heat shock protein 90kDa alpha (cytosolic), class A member 1 isoform 2
Type:
Molecular Chaperone
Mol. Mass.:
84623.45
Organism:
Homo sapiens (Human)
Description:
P07900
Residue:
732
  
Inhibitor
Name:
BDBM81914
Synonyms:
Ethyl carbamate analog, 3
Type:
Small organic molecule
Emp. Form.:
C18H18N4O4S
Mol. Mass.:
386.425
SMILES:
CCOC(=O)NCc1ccc(cc1)-n1c(n[nH]c1=S)-c1ccc(O)cc1O
: