Target
Proto-oncogene tyrosine-protein kinase Src
Ligand
BDBM3009
Substrate
Poly(Glu,Tyr)
Meas. Tech.
Kinase Inhibition Assay
IC50
>10000±n/a nM
Citation
 Traxler, PBold, GFrei, JLang, MLydon, NMett, HBuchdunger, EMeyer, TMueller, MFuret, P Use of a pharmacophore model for the design of EGF-R tyrosine kinase inhibitors: 4-(phenylamino)pyrazolo[3,4-d]pyrimidines. J Med Chem 40:3601-16 (1997)  
Target
Name:
Proto-oncogene tyrosine-protein kinase Src
Synonyms:
Calmodulin/Proto-oncogene tyrosine-protein kinase Src Proto-oncogene c-Src SRC SRC_HUMAN V-src sarcoma (Schmidt-Ruppin A-2) viral oncogene homolog (avian) p60-Src | pp60c-src
Type:
Protein
Mol. Mass.:
59838.60
Organism:
Homo sapiens (Human)
Description:
P12931
Residue:
536
  
Inhibitor
Name:
BDBM3009
Synonyms:
3-((3-Chlorophenyl)amino)-4-((3-bromophenyl)amino)-1H-pyrazolo[3,4-d]pyrimidine 4-N-(3-bromophenyl)-3-N-(3-chlorophenyl)-1H-pyrazolo[3,4-d]pyrimidine-3,4-diamine
Type:
Small organic molecule
Emp. Form.:
C17H12BrClN6
Mol. Mass.:
415.674
SMILES:
Clc1cccc(Nc2[nH]nc3ncnc(Nc4cccc(Br)c4)c23)c1
:
Substrate
Name:
Poly(Glu,Tyr)
Synonyms:
poly(E:Y) 4:1 | poly(Glu4/Tyr)
Type:
Random Polymer
Mol. Mass.:
358.43
Organism:
Description:
Residue:
3
NA