Target
Protein kinase C alpha type
Ligand
BDBM3022
Substrate
Protamine Sulfate
Meas. Tech.
Kinase Inhibition Assay
IC50
>10000±n/a nM
Citation
 Traxler, PBold, GFrei, JLang, MLydon, NMett, HBuchdunger, EMeyer, TMueller, MFuret, P Use of a pharmacophore model for the design of EGF-R tyrosine kinase inhibitors: 4-(phenylamino)pyrazolo[3,4-d]pyrimidines. J Med Chem 40:3601-16 (1997)  
Target
Name:
Protein kinase C alpha type
Synonyms:
KPCA_BOVIN PRKCA Protein kinase C alpha
Type:
Enzyme
Mol. Mass.:
76842.76
Organism:
Bos taurus (bovine)
Description:
Residue:
672
  
Inhibitor
Name:
BDBM3022
Synonyms:
4-(Phenylamino)pyrazolo[3,4-d]pyrimidine deriv. 23 | N-(3-chlorophenyl)-3-phenyl-1H-pyrazolo[3,4-d]pyrimidin-4-amine
Type:
Small organic molecule
Emp. Form.:
C17H12ClN5
Mol. Mass.:
321.764
SMILES:
Clc1cccc(Nc2ncnc3n[nH]c(-c4ccccc4)c23)c1
:
Substrate
Name:
Protamine Sulfate
Synonyms:
Type:
Other Protein Type
Mol. Mass.:
358.43
Organism:
Description:
A purified mixture of simple protein obtained from the sperm or testes of suitable species of fish.
Residue:
3
NA