Target
Epidermal growth factor receptor
Ligand
BDBM3031
Substrate
Angiotensin II
Meas. Tech.
Kinase Inhibition Assay
IC50
870±n/a nM
Citation
 Traxler, PBold, GFrei, JLang, MLydon, NMett, HBuchdunger, EMeyer, TMueller, MFuret, P Use of a pharmacophore model for the design of EGF-R tyrosine kinase inhibitors: 4-(phenylamino)pyrazolo[3,4-d]pyrimidines. J Med Chem 40:3601-16 (1997)  
Target
Name:
Epidermal growth factor receptor
Synonyms:
EGF Receptor Substrate EGFR_HUMAN ERBB1 Epidermal Growth Factor Receptor erbB-1 Epidermal growth factor receptor (EGFR) HER1 Proto-oncogene c-ErbB-1 Tyrosine-Protein Kinase ErbB-1
Type:
Receptor Kinase Domain
Mol. Mass.:
134279.59
Organism:
Homo sapiens (Human)
Description:
P00533
Residue:
1210
  
Inhibitor
Name:
BDBM3031
Synonyms:
3-((3-Chlorophenyl)amino)-4-(benzylamino)-1H-pyrazolo[3,4-d]pyrimidine 4-N-benzyl-3-N-(3-chlorophenyl)-1H-pyrazolo[3,4-d]pyrimidine-3,4-diamine
Type:
Small organic molecule
Emp. Form.:
C18H15ClN6
Mol. Mass.:
350.805
SMILES:
Clc1cccc(Nc2[nH]nc3ncnc(NCc4ccccc4)c23)c1
:
Substrate
Name:
Angiotensin II
Synonyms:
Hypertensin II
Type:
Peptide
Mol. Mass.:
2572.92
Organism:
Description:
Residue:
23